- _ALWAYS() - Static method in class com.testdroid.jenkins.Messages
-
Always
- _API_GET_TESTRUN_ERROR(Object) - Static method in class com.testdroid.jenkins.Messages
-
"Error during get testRun({0}) by api."
- _APP_CRAWLER() - Static method in class com.testdroid.jenkins.Messages
-
App Crawler
- _APPLICATION_S_NOT_CHANGED_NOT_UPLOADING() - Static method in class com.testdroid.jenkins.Messages
-
Application file %s does not differ from latest version in Cloud - not uploading
- _AUTHORIZATION_OK() - Static method in class com.testdroid.jenkins.Messages
-
Authorization ok.
- _CHECK_FOR_TESTRUN_STATE(Object) - Static method in class com.testdroid.jenkins.Messages
-
"Check for testRun({0}) state."
- _CHECK_PROJECT_NAME() - Static method in class com.testdroid.jenkins.Messages
-
Please check project name
- _COLUMN_PROGRESS() - Static method in class com.testdroid.jenkins.Messages
-
Testdroid Cloud (finished progress)
- _COLUMN_STATUS() - Static method in class com.testdroid.jenkins.Messages
-
Testdroid Cloud (status)
- _COLUMN_SUCCESS_RATE() - Static method in class com.testdroid.jenkins.Messages
-
Testdroid Cloud (success rate)
- _DOWNLOAD_RESULTS_FAILED() - Static method in class com.testdroid.jenkins.Messages
-
Problem occurred during download results from Cloud back.
- _DOWNLOAD_RESULTS_FAILED_WITH_REASON_S() - Static method in class com.testdroid.jenkins.Messages
-
Problem occurred during download results from Cloud back: %s
- _EMPTY_PROJECT() - Static method in class com.testdroid.jenkins.Messages
-
Empty project name
- _ERROR_API() - Static method in class com.testdroid.jenkins.Messages
-
Problem with Testdroid API.
- _ERROR_APP_PATH() - Static method in class com.testdroid.jenkins.Messages
-
Empty application path
- _ERROR_AUTHORIZATION() - Static method in class com.testdroid.jenkins.Messages
-
Authorization error.
- _ERROR_CONNECTION() - Static method in class com.testdroid.jenkins.Messages
-
Connection error
- _ERROR_DURING_DOWNLOAD_S_FROM_S() - Static method in class com.testdroid.jenkins.Messages
-
Error during download %s from %s
- _ERROR_FILE_NOT_FOUND() - Static method in class com.testdroid.jenkins.Messages
-
File not found
- _ERROR_GET_CLUSTER() - Static method in class com.testdroid.jenkins.Messages
-
Failed getting device clusters
- _ERROR_INSTRUMENTATION_PATH() - Static method in class com.testdroid.jenkins.Messages
-
Empty instrumentation path
- _ERROR_TESTDROID() - Static method in class com.testdroid.jenkins.Messages
-
Testdroid error
- _INSTRUMENTATION_S_NOT_CHANGED_NOT_UPLOADING() - Static method in class com.testdroid.jenkins.Messages
-
Instrumentation file %s does not differ from latest version in Cloud - not uploading
- _LOCALE() - Static method in class com.testdroid.jenkins.Messages
-
Locale
- _NO_DEVICE_GROUP_CHOSEN() - Static method in class com.testdroid.jenkins.Messages
-
You have to set device group before run in Cloud.
- _NO_RESULT_FROM_DEVICE_TEST_WAS_NOT_LAUNCHED_S() - Static method in class com.testdroid.jenkins.Messages
-
There are no results for device %s.
- _ON_FAILURE_ONLY() - Static method in class com.testdroid.jenkins.Messages
-
On failure only
- _PLUGIN_NAME() - Static method in class com.testdroid.jenkins.Messages
-
Testdroid Plugin for CI
- _PRICE() - Static method in class com.testdroid.jenkins.Messages
-
Price
- _PROGRESS() - Static method in class com.testdroid.jenkins.Messages
-
Progress
- _PROGRESS_DESCRIPTION() - Static method in class com.testdroid.jenkins.Messages
-
WAITING: %d / RUNNING: %d / FINISHED: %d / NUMBER OF DEVICES: %d
- _PROGRESS_ERROR() - Static method in class com.testdroid.jenkins.Messages
-
Not available
- _PROGRESS_PROGRESS_TIP() - Static method in class com.testdroid.jenkins.Messages
-
%d'%' of devices have finished
- _PROGRESS_TIP() - Static method in class com.testdroid.jenkins.Messages
-
Percentage of finished devices
- _PROJECT() - Static method in class com.testdroid.jenkins.Messages
-
Project
- _RUN_TEST_IN_CLOUD_FAILED() - Static method in class com.testdroid.jenkins.Messages
-
Run test in Testdroid Cloud failed
- _RUN_TEST_IN_CLOUD_STARTED() - Static method in class com.testdroid.jenkins.Messages
-
Run test in Testdroid Cloud process started...
- _RUN_TEST_IN_CLOUD_SUCCEEDED() - Static method in class com.testdroid.jenkins.Messages
-
Run test in Testdroid Cloud succeeded
- _RUNNING_TESTS() - Static method in class com.testdroid.jenkins.Messages
-
Running tests
- _SCHEDULER() - Static method in class com.testdroid.jenkins.Messages
-
Scheduler
- _SCHEDULER_PARALLEL() - Static method in class com.testdroid.jenkins.Messages
-
Run on all devices simultaneously
- _SCHEDULER_SERIAL() - Static method in class com.testdroid.jenkins.Messages
-
Run on one device at a time
- _SCHEDULER_SINGLE() - Static method in class com.testdroid.jenkins.Messages
-
Run only on one device from group
- _STATUS() - Static method in class com.testdroid.jenkins.Messages
-
Status
- _STATUS_ERROR() - Static method in class com.testdroid.jenkins.Messages
-
Not available
- _STATUS_TIP() - Static method in class com.testdroid.jenkins.Messages
-
Current test run status
- _SUCCESS_RATE() - Static method in class com.testdroid.jenkins.Messages
-
Success rate
- _SUCCESS_RATE_DESCRIPTION() - Static method in class com.testdroid.jenkins.Messages
-
Successful: %d; Failed: %d
- _SUCCESS_RATE_ERROR() - Static method in class com.testdroid.jenkins.Messages
-
Not available
- _SUCCESS_RATE_PROGRESS_TIP() - Static method in class com.testdroid.jenkins.Messages
-
Test run finished without error on %d'%' of devices
- _SUCCESS_RATE_TIP() - Static method in class com.testdroid.jenkins.Messages
-
Succeeded and failed tests on devices
- _TEST_RUN_CONFIGURATION() - Static method in class com.testdroid.jenkins.Messages
-
Using test run configuration:
- _TEST_TIMEOUT_NOT_NUMERIC_VALUE() - Static method in class com.testdroid.jenkins.Messages
-
Failed to parse test timeout value: %s.
- _TESTDROID_RUN_TESTS_IN_CLOUD() - Static method in class com.testdroid.jenkins.Messages
-
Testdroid: Run tests in Testdroid Cloud
- _TIMEOUT() - Static method in class com.testdroid.jenkins.Messages
-
Timeout
- _UNLIMITED() - Static method in class com.testdroid.jenkins.Messages
-
unlimited
- _UPLOADING_APPLICATION() - Static method in class com.testdroid.jenkins.Messages
-
Uploading application file
- _UPLOADING_DATA_FILE_S() - Static method in class com.testdroid.jenkins.Messages
-
Uploading data file %s
- _UPLOADING_INSTRUMENTATION() - Static method in class com.testdroid.jenkins.Messages
-
Uploading instrumentation file
- _UPLOADING_NEW_APPLICATION_S() - Static method in class com.testdroid.jenkins.Messages
-
Uploading new application file %s
- _UPLOADING_NEW_INSTRUMENTATION_S() - Static method in class com.testdroid.jenkins.Messages
-
Uploading new instrumentation file %s